{"text_format":"1","workbook":"xlsx","n_sheets":11,"sheets":["メニュー","受注台帳","印刷対象データ","見積書","納品書受領書","請求書","領収書","得意先マスター","商品マスター","事業主情報","ログイン情報"],"not_rendered":{"charts":0,"images":7,"macros":1,"external_links":0,"defined_names":5,"comments":2,"pivot_tables":0},"unopened":[],"bounds":{"document_bytes":16777216,"sheet_cells":100000,"rows_first":2000,"rows_last":500,"rows_between":2000,"halvings":0,"cell_chars":16384,"cell_head_chars":4096},"cells_cut":0,"cells_raw":0,"read":"whole","date_system":"1900"}

{"sheet":"メニュー","index":0,"n_rows":27,"n_cols":25,"rows_kept":27,"cut":false,"hidden":false,"merged":[]}
[]
[]
[]
[null,null,null,"見積書作成、納品・受領書作成、請求書作成、領収書作成、受注内容確認時等…"]
[null,null,"operation"]
[]
[null,null,null,null,null,null,null,null,null,null,"注文データを"]
[null,null,null,null,null,null,null,null,null,null,"数年間管理する"]
{"$rows_left_out":20}
{"sheet":"受注台帳","index":1,"n_rows":200,"n_cols":69,"rows_kept":200,"cut":false,"hidden":false,"merged":[[0,64,0,68],[2,29,2,33],[2,34,2,38],[2,39,2,43],[2,44,2,48],[2,49,2,53],[2,24,2,28],[2,6,3,6],[2,54,2,58],[2,59,2,63],[2,64,2,68],[2,5,3,5],[2,1,3,1],[2,7,2,12],[2,14,2,18],[2,19,2,23],[0,2,0,3],[2,0,3,0],[2,2,3,2],[2,3,3,3],[2,4,3,4]]}
[null,null,"販売管理台帳",null,8,null,null,null,null,null,"←塗りつぶしセルは入力不可保護扱い",null,null,null,null,null,null,null,null,null,null,null,null,null,null,null,null,null,null,null,null,null,null,null,null,null,null,null,null,null,null,null,null,null,null,null,null,null,null,null,null,null,null,null,null,null,null,null,null,null,null,null,null,null,"総合計"]
[null,null,null,null,null,null,null,null,null,null,null,null,null,null,null,null,null,null,null,null,null,null,null,null,null,null,null,null,null,null,null,null,null,null,null,null,null,null,null,null,null,null,null,null,null,null,null,null,null,null,null,null,null,null,null,null,null,null,null,null,null,null,null,null,{"$f":"SUM(BM5:BM200)","v":1407800},null,{"$f":"SUM(BO5:BO200)","v":140780},{"$f":"SUM(BP5:BP200)","v":80},{"$f":"SUM(BQ5:BQ200)","v":1548500}]
["月度","見積日","受注日","納品日","請求日","入金日","伝票番号","注文",null,null,null,null,null,null,"１項目",null,null,null,null,"２項目",null,null,null,null,"３項目",null,null,null,null,"４項目",null,null,null,null,"５項目",null,null,null,null,"６項目",null,null,null,null,"７項目",null,null,null,null,"８項目",null,null,null,null,"９項目",null,null,null,null,"１０項目",null,null,null,null,"合計"]
[null,null,null,null,null,null,null,"得意先\nコード","会社名","担当者","郵便番号","住所1","住所2",null,"商品\nコード","商品名","数量","単価","金額","商品\nコード","商品名","数量","単価","金額","商品\nコード","商品名","数量","単価","金額","商品\nコード","商品名","数量","単価","金額","商品\nコード","商品名","数量","単価","金額","商品\nコード","商品名","数量","単価","金額","商品\nコード","商品名","数量","単価","金額","商品\nコード","商品名","数量","単価","金額","商品\nコード","商品名","数量","単価","金額","商品\nコード","商品名","数量","単価","金額","合計金額","税率","消費税","値引き","合計"]
[{"$f":"IF(ISBLANK(C5),\"\",MONTH(C5))","v":12},"2021-12-20","2021-12-22","2021-12-24","2021-12-26","2021-12-28",22001,1101,{"$f":"IFERROR(VLOOKUP(H5,得意先マスター!$B$7:$H$103,2,FALSE),\"\")","v":"東京アトリエ"},{"$f":"IFERROR(VLOOKUP(H5,得意先マスター!$B$7:$H$103,3,FALSE),\"\")","v":"商品開発部　新庄"},{"$f":"IFERROR(VLOOKUP(H5,得意先マスター!$B$7:$H$103,4,FALSE),\"\")","v":"131-0045"},{"$f":"IFERROR(VLOOKUP(H5,得意先マスター!$B$7:$H$103,5,FALSE),\"\")","v":"東京都墨田区"},{"$f":"IFERROR(VLOOKUP(H5,得意先マスター!$B$7:$H$103,6,FALSE),\"\")","v":"押上１丁目１−２"},null,11101,{"$f":"IFERROR(VLOOKUP(O5,商品マスター!$B$7:$D$53,2,FALSE),\"\")","v":"ミニテーブル"},10,{"$f":"IFERROR(VLOOKUP(O5,商品マスター!$B$7:$D$53,3,FALSE),\"\")","v":1200},{"$f":"IFERROR(Q5*R5,0)","v":12000},11201,{"$f":"IFERROR(VLOOKUP(T5,商品マスター!$B$7:$D$53,2,FALSE),\"\")","v":"隙間に便利なミニテーブル"},20,{"$f":"IFERROR(VLOOKUP(T5,商品マスター!$B$7:$D$53,3,FALSE),\"\")","v":3000},{"$f":"IFERROR(V5*W5,0)","v":60000},12101,{"$f":"IFERROR(VLOOKUP(Y5,商品マスター!$B$7:$D$53,2,FALSE),\"\")","v":"綺麗な歯ブラシ置き場"},30,{"$f":"IFERROR(VLOOKUP(Y5,商品マスター!$B$7:$D$53,3,FALSE),\"\")","v":1200},{"$f":"IFERROR(AA5*AB5,0)","v":36000},12201,{"$f":"IFERROR(VLOOKUP(AD5,商品マスター!$B$7:$D$53,2,FALSE),\"\")","v":"スッキリさせるポケット収納"},40,{"$f":"IFERROR(VLOOKUP(AD5,商品マスター!$B$7:$D$53,3,FALSE),\"\")","v":3000},{"$f":"IFERROR(AF5*AG5,0)","v":120000},13101,{"$f":"IFERROR(VLOOKUP(AI5,商品マスター!$B$7:$D$53,2,FALSE),\"\")","v":"紙物収納ウォールラック"},50,{"$f":"IFERROR(VLOOKUP(AI5,商品マスター!$B$7:$D$53,3,FALSE),\"\")","v":1500},{"$f":"IFERROR(AK5*AL5,0)","v":75000},13201,{"$f":"IFERROR(VLOOKUP(AN5,商品マスター!$B$7:$D$53,2,FALSE),\"\")","v":"コンパクトなマガジンラック"},60,{"$f":"IFERROR(VLOOKUP(AN5,商品マスター!$B$7:$D$53,3,FALSE),\"\")","v":2500},{"$f":"IFERROR(AP5*AQ5,0)","v":150000},13201,{"$f":"IFERROR(VLOOKUP(AS5,商品マスター!$B$7:$D$53,2,FALSE),\"\")","v":"コンパクトなマガジンラック"},70,{"$f":"IFERROR(VLOOKUP(AS5,商品マスター!$B$7:$D$53,3,FALSE),\"\")","v":2500},{"$f":"IFERROR(AU5*AV5,0)","v":175000},13201,{"$f":"IFERROR(VLOOKUP(AX5,商品マスター!$B$7:$D$53,2,FALSE),\"\")","v":"コンパクトなマガジンラック"},80,{"$f":"IFERROR(VLOOKUP(AX5,商品マスター!$B$7:$D$53,3,FALSE),\"\")","v":2500},{"$f":"IFERROR(AZ5*BA5,0)","v":200000},13201,{"$f":"IFERROR(VLOOKUP(BC5,商品マスター!$B$7:$D$53,2,FALSE),\"\")","v":"コンパクトなマガジンラック"},90,{"$f":"IFERROR(VLOOKUP(BC5,商品マスター!$B$7:$D$53,3,FALSE),\"\")","v":2500},{"$f":"IFERROR(BE5*BF5,0)","v":225000},13201,{"$f":"IFERROR(VLOOKUP(BH5,商品マスター!$B$7:$D$53,2,FALSE),\"\")","v":"コンパクトなマガジンラック"},100,{"$f":"IFERROR(VLOOKUP(BH5,商品マスター!$B$7:$D$53,3,FALSE),\"\")","v":2500},{"$f":"IFERROR(BJ5*BK5,0)","v":250000},{"$f":"IFERROR(S5+X5+AC5+AH5+AM5+AR5+AW5+BB5+BG5+BL5, \"\")","v":1303000},0.1,{"$f":"IFERROR(BM5*BN5, \"\")","v":130300},null,{"$f":"BM5+BO5-BP5","v":1433300}]
[{"$f":"IF(ISBLANK(C6),\"\",MONTH(C6))","v":5},"2022-05-10","2022-05-12",null,null,null,22002,1101,{"$f":"IFERROR(VLOOKUP(H6,得意先マスター!$B$7:$H$103,2,FALSE),\"\")","v":"東京アトリエ"},{"$f":"IFERROR(VLOOKUP(H6,得意先マスター!$B$7:$H$103,3,FALSE),\"\")","v":"商品開発部　新庄"},{"$f":"IFERROR(VLOOKUP(H6,得意先マスター!$B$7:$H$103,4,FALSE),\"\")","v":"131-0045"},{"$f":"IFERROR(VLOOKUP(H6,得意先マスター!$B$7:$H$103,5,FALSE),\"\")","v":"東京都墨田区"},{"$f":"IFERROR(VLOOKUP(H6,得意先マスター!$B$7:$H$103,6,FALSE),\"\")","v":"押上１丁目１−２"},null,11101,{"$f":"IFERROR(VLOOKUP(O6,商品マスター!$B$7:$D$53,2,FALSE),\"\")","v":"ミニテーブル"},1,{"$f":"IFERROR(VLOOKUP(O6,商品マスター!$B$7:$D$53,3,FALSE),\"\")","v":1200},{"$f":"IFERROR(Q6*R6,0)","v":1200},11201,{"$f":"IFERROR(VLOOKUP(T6,商品マスター!$B$7:$D$53,2,FALSE),\"\")","v":"隙間に便利なミニテーブル"},2,{"$f":"IFERROR(VLOOKUP(T6,商品マスター!$B$7:$D$53,3,FALSE),\"\")","v":3000},{"$f":"IFERROR(V6*W6,0)","v":6000},12101,{"$f":"IFERROR(VLOOKUP(Y6,商品マスター!$B$7:$D$53,2,FALSE),\"\")","v":"綺麗な歯ブラシ置き場"},3,{"$f":"IFERROR(VLOOKUP(Y6,商品マスター!$B$7:$D$53,3,FALSE),\"\")","v":1200},{"$f":"IFERROR(AA6*AB6,0)","v":3600},12201,{"$f":"IFERROR(VLOOKUP(AD6,商品マスター!$B$7:$D$53,2,FALSE),\"\")","v":"スッキリさせるポケット収納"},4,{"$f":"IFERROR(VLOOKUP(AD6,商品マスター!$B$7:$D$53,3,FALSE),\"\")","v":3000},{"$f":"IFERROR(AF6*AG6,0)","v":12000},13101,{"$f":"IFERROR(VLOOKUP(AI6,商品マスター!$B$7:$D$53,2,FALSE),\"\")","v":"紙物収納ウォールラック"},5,{"$f":"IFERROR(VLOOKUP(AI6,商品マスター!$B$7:$D$53,3,FALSE),\"\")","v":1500},{"$f":"IFERROR(AK6*AL6,0)","v":7500},13201,{"$f":"IFERROR(VLOOKUP(AN6,商品マスター!$B$7:$D$53,2,FALSE),\"\")","v":"コンパクトなマガジンラック"},6,{"$f":"IFERROR(VLOOKUP(AN6,商品マスター!$B$7:$D$53,3,FALSE),\"\")","v":2500},{"$f":"IFERROR(AP6*AQ6,0)","v":15000},null,{"$f":"IFERROR(VLOOKUP(AS6,商品マスター!$B$7:$D$53,2,FALSE),\"\")","v":""},null,{"$f":"IFERROR(VLOOKUP(AS6,商品マスター!$B$7:$D$53,3,FALSE),\"\")","v":""},{"$f":"IFERROR(AU6*AV6,0)","v":0},null,{"$f":"IFERROR(VLOOKUP(AX6,商品マスター!$B$7:$D$53,2,FALSE),\"\")","v":""},null,{"$f":"IFERROR(VLOOKUP(AX6,商品マスター!$B$7:$D$53,3,FALSE),\"\")","v":""},{"$f":"IFERROR(AZ6*BA6,0)","v":0},null,{"$f":"IFERROR(VLOOKUP(BC6,商品マスター!$B$7:$D$53,2,FALSE),\"\")","v":""},null,{"$f":"IFERROR(VLOOKUP(BC6,商品マスター!$B$7:$D$53,3,FALSE),\"\")","v":""},{"$f":"IFERROR(BE6*BF6,0)","v":0},null,{"$f":"IFERROR(VLOOKUP(BH6,商品マスター!$B$7:$D$53,2,FALSE),\"\")","v":""},null,{"$f":"IFERROR(VLOOKUP(BH6,商品マスター!$B$7:$D$53,3,FALSE),\"\")","v":""},{"$f":"IFERROR(BJ6*BK6,0)","v":0},{"$f":"IFERROR(S6+X6+AC6+AH6+AM6+AR6+AW6+BB6+BG6+BL6, \"\")","v":45300},0.1,{"$f":"IFERROR(BM6*BN6, \"\")","v":4530},30,{"$f":"BM6+BO6-BP6","v":49800}]
[{"$f":"IF(ISBLANK(C7),\"\",MONTH(C7))","v":6},"2022-06-01","2022-06-03","2022-06-05",null,null,22003,2101,{"$f":"IFERROR(VLOOKUP(H7,得意先マスター!$B$7:$H$103,2,FALSE),\"\")","v":"東京ヒルズ"},{"$f":"IFERROR(VLOOKUP(H7,得意先マスター!$B$7:$H$103,3,FALSE),\"\")","v":"営業部　山下"},{"$f":"IFERROR(VLOOKUP(H7,得意先マスター!$B$7:$H$103,4,FALSE),\"\")","v":"123-4567"},{"$f":"IFERROR(VLOOKUP(H7,得意先マスター!$B$7:$H$103,5,FALSE),\"\")","v":"東京都港区"},{"$f":"IFERROR(VLOOKUP(H7,得意先マスター!$B$7:$H$103,6,FALSE),\"\")","v":"六本木10-20-30"},null,11201,{"$f":"IFERROR(VLOOKUP(O7,商品マスター!$B$7:$D$53,2,FALSE),\"\")","v":"隙間に便利なミニテーブル"},2,{"$f":"IFERROR(VLOOKUP(O7,商品マスター!$B$7:$D$53,3,FALSE),\"\")","v":3000},{"$f":"IFERROR(Q7*R7,0)","v":6000},null,{"$f":"IFERROR(VLOOKUP(T7,商品マスター!$B$7:$D$53,2,FALSE),\"\")","v":""},null,{"$f":"IFERROR(VLOOKUP(T7,商品マスター!$B$7:$D$53,3,FALSE),\"\")","v":""},{"$f":"IFERROR(V7*W7,0)","v":0},null,{"$f":"IFERROR(VLOOKUP(Y7,商品マスター!$B$7:$D$53,2,FALSE),\"\")","v":""},null,{"$f":"IFERROR(VLOOKUP(Y7,商品マスター!$B$7:$D$53,3,FALSE),\"\")","v":""},{"$f":"IFERROR(AA7*AB7,0)","v":0},null,{"$f":"IFERROR(VLOOKUP(AD7,商品マスター!$B$7:$D$53,2,FALSE),\"\")","v":""},null,{"$f":"IFERROR(VLOOKUP(AD7,商品マスター!$B$7:$D$53,3,FALSE),\"\")","v":""},{"$f":"IFERROR(AF7*AG7,0)","v":0},null,{"$f":"IFERROR(VLOOKUP(AI7,商品マスター!$B$7:$D$53,2,FALSE),\"\")","v":""},null,{"$f":"IFERROR(VLOOKUP(AI7,商品マスター!$B$7:$D$53,3,FALSE),\"\")","v":""},{"$f":"IFERROR(AK7*AL7,0)","v":0},null,{"$f":"IFERROR(VLOOKUP(AN7,商品マスター!$B$7:$D$53,2,FALSE),\"\")","v":""},null,{"$f":"IFERROR(VLOOKUP(AN7,商品マスター!$B$7:$D$53,3,FALSE),\"\")","v":""},{"$f":"IFERROR(AP7*AQ7,0)","v":0},null,{"$f":"IFERROR(VLOOKUP(AS7,商品マスター!$B$7:$D$53,2,FALSE),\"\")","v":""},null,{"$f":"IFERROR(VLOOKUP(AS7,商品マスター!$B$7:$D$53,3,FALSE),\"\")","v":""},{"$f":"IFERROR(AU7*AV7,0)","v":0},null,{"$f":"IFERROR(VLOOKUP(AX7,商品マスター!$B$7:$D$53,2,FALSE),\"\")","v":""},null,{"$f":"IFERROR(VLOOKUP(AX7,商品マスター!$B$7:$D$53,3,FALSE),\"\")","v":""},{"$f":"IFERROR(AZ7*BA7,0)","v":0},null,{"$f":"IFERROR(VLOOKUP(BC7,商品マスター!$B$7:$D$53,2,FALSE),\"\")","v":""},null,{"$f":"IFERROR(VLOOKUP(BC7,商品マスター!$B$7:$D$53,3,FALSE),\"\")","v":""},{"$f":"IFERROR(BE7*BF7,0)","v":0},null,{"$f":"IFERROR(VLOOKUP(BH7,商品マスター!$B$7:$D$53,2,FALSE),\"\")","v":""},null,{"$f":"IFERROR(VLOOKUP(BH7,商品マスター!$B$7:$D$53,3,FALSE),\"\")","v":""},{"$f":"IFERROR(BJ7*BK7,0)","v":0},{"$f":"IFERROR(S7+X7+AC7+AH7+AM7+AR7+AW7+BB7+BG7+BL7, \"\")","v":6000},0.1,{"$f":"IFERROR(BM7*BN7, \"\")","v":600},null,{"$f":"BM7+BO7-BP7","v":6600}]
[6,"2022-06-10","2022-06-11","2022-06-15","2022-06-15","2022-06-30",22004,2101,{"$f":"IFERROR(VLOOKUP(H8,得意先マスター!$B$7:$H$103,2,FALSE),\"\")","v":"東京ヒルズ"},{"$f":"IFERROR(VLOOKUP(H8,得意先マスター!$B$7:$H$103,3,FALSE),\"\")","v":"営業部　山下"},{"$f":"IFERROR(VLOOKUP(H8,得意先マスター!$B$7:$H$103,4,FALSE),\"\")","v":"123-4567"},{"$f":"IFERROR(VLOOKUP(H8,得意先マスター!$B$7:$H$103,5,FALSE),\"\")","v":"東京都港区"},{"$f":"IFERROR(VLOOKUP(H8,得意先マスター!$B$7:$H$103,6,FALSE),\"\")","v":"六本木10-20-30"},null,12102,{"$f":"IFERROR(VLOOKUP(O8,商品マスター!$B$7:$D$53,2,FALSE),\"\")","v":"バタフライチェア　ネイビー"},5,{"$f":"IFERROR(VLOOKUP(O8,商品マスター!$B$7:$D$53,3,FALSE),\"\")","v":4900},24500,13102,{"$f":"IFERROR(VLOOKUP(T8,商品マスター!$B$7:$D$53,2,FALSE),\"\")","v":"木製折りたたみラック"},10,{"$f":"IFERROR(VLOOKUP(T8,商品マスター!$B$7:$D$53,3,FALSE),\"\")","v":2900},29000,null,{"$f":"IFERROR(VLOOKUP(Y8,商品マスター!$B$7:$D$53,2,FALSE),\"\")","v":""},null,{"$f":"IFERROR(VLOOKUP(Y8,商品マスター!$B$7:$D$53,3,FALSE),\"\")","v":""},0,null,{"$f":"IFERROR(VLOOKUP(AD8,商品マスター!$B$7:$D$53,2,FALSE),\"\")","v":""},null,{"$f":"IFERROR(VLOOKUP(AD8,商品マスター!$B$7:$D$53,3,FALSE),\"\")","v":""},0,null,{"$f":"IFERROR(VLOOKUP(AI8,商品マスター!$B$7:$D$53,2,FALSE),\"\")","v":""},null,{"$f":"IFERROR(VLOOKUP(AI8,商品マスター!$B$7:$D$53,3,FALSE),\"\")","v":""},0,null,{"$f":"IFERROR(VLOOKUP(AN8,商品マスター!$B$7:$D$53,2,FALSE),\"\")","v":""},null,{"$f":"IFERROR(VLOOKUP(AN8,商品マスター!$B$7:$D$53,3,FALSE),\"\")","v":""},0,null,{"$f":"IFERROR(VLOOKUP(AS8,商品マスター!$B$7:$D$53,2,FALSE),\"\")","v":""},null,{"$f":"IFERROR(VLOOKUP(AS8,商品マスター!$B$7:$D$53,3,FALSE),\"\")","v":""},0,null,{"$f":"IFERROR(VLOOKUP(AX8,商品マスター!$B$7:$D$53,2,FALSE),\"\")","v":""},null,{"$f":"IFERROR(VLOOKUP(AX8,商品マスター!$B$7:$D$53,3,FALSE),\"\")","v":""},0,null,{"$f":"IFERROR(VLOOKUP(BC8,商品マスター!$B$7:$D$53,2,FALSE),\"\")","v":""},null,{"$f":"IFERROR(VLOOKUP(BC8,商品マスター!$B$7:$D$53,3,FALSE),\"\")","v":""},0,null,{"$f":"IFERROR(VLOOKUP(BH8,商品マスター!$B$7:$D$53,2,FALSE),\"\")","v":""},null,{"$f":"IFERROR(VLOOKUP(BH8,商品マスター!$B$7:$D$53,3,FALSE),\"\")","v":""},0,53500,0.1,5350,50,58800]
{"$rows_left_out":193}
{"sheet":"印刷対象データ","index":2,"n_rows":23,"n_cols":69,"rows_kept":23,"cut":false,"hidden":false,"merged":[[18,3,18,4],[22,3,22,4],[2,7,2,12],[0,64,0,68],[2,14,2,18],[2,19,2,23],[2,24,2,28],[2,29,2,33],[2,34,2,38],[2,39,2,43],[2,44,2,48],[2,49,2,53],[2,54,2,58],[2,59,2,63],[2,64,2,68],[14,3,14,4],[10,3,10,4],[2,5,3,5],[2,6,3,6],[2,0,3,0],[2,1,3,1],[2,2,3,2],[2,3,3,3],[2,4,3,4]]}
[null,null,null,"印刷対象データ抽出データ",null,null,null,null,null,null,"←塗りつぶしセルは入力不可保護扱い",null,null,null,null,null,null,null,null,null,null,null,null,null,null,null,null,null,null,null,null,null,null,null,null,null,null,null,null,null,null,null,null,null,null,null,null,null,null,null,null,null,null,null,null,null,null,null,null,null,null,null,null,null,"総合計"]
[null,null,null,null,null,null,null,null,null,null,null,null,null,null,null,null,null,null,null,null,null,null,null,null,null,null,null,null,null,null,null,null,null,null,null,null,null,null,null,null,null,null,null,null,null,null,null,null,null,null,null,null,null,null,null,null,null,null,null,null,null,null,null,null,{"$f":"SUM(BM5:BM198)","v":53500},null,{"$f":"SUM(BO5:BO198)","v":5350},{"$f":"SUM(BP5:BP198)","v":50},{"$f":"SUM(BQ5:BQ198)","v":58800}]
["月度","見積日","受注日","納品日","請求日","入金日","伝票番号","注文",null,null,null,null,null,null,"１項目",null,null,null,null,"２項目",null,null,null,null,"３項目",null,null,null,null,"４項目",null,null,null,null,"５項目",null,null,null,null,"６項目",null,null,null,null,"７項目",null,null,null,null,"８項目",null,null,null,null,"９項目",null,null,null,null,"１０項目",null,null,null,null,"合計"]
[null,null,null,null,null,null,null,"得意先コード","会社名","担当者","郵便番号","住所1","住所2",null,"商品コード","商品名","数量","単価","金額","商品コード","商品名","数量","単価","金額","商品コード","商品名","数量","単価","金額","商品コード","商品名","数量","単価","金額","商品コード","商品名","数量","単価","金額","商品コード","商品名","数量","単価","金額","商品コード","商品名","数量","単価","金額","商品コード","商品名","数量","単価","金額","商品コード","商品名","数量","単価","金額","商品コード","商品名","数量","単価","金額","合計金額","税率","消費税","値引き","合計"]
[{"$f":"IF(ISBLANK(C5),\"\",MONTH(C5))","v":6},"2022-06-10","2022-06-11","2022-06-15","2022-06-15","2022-06-30",22004,2101,{"$f":"IFERROR(VLOOKUP(H5,得意先マスター!$B$7:$H$103,2,FALSE),\"\")","v":"東京ヒルズ"},{"$f":"IFERROR(VLOOKUP(H5,得意先マスター!$B$7:$H$103,3,FALSE),\"\")","v":"営業部　山下"},{"$f":"IFERROR(VLOOKUP(H5,得意先マスター!$B$7:$H$103,4,FALSE),\"\")","v":"123-4567"},{"$f":"IFERROR(VLOOKUP(H5,得意先マスター!$B$7:$H$103,5,FALSE),\"\")","v":"東京都港区"},{"$f":"IFERROR(VLOOKUP(H5,得意先マスター!$B$7:$H$103,6,FALSE),\"\")","v":"六本木10-20-30"},null,12102,{"$f":"IFERROR(VLOOKUP(O5,商品マスター!$B$7:$D$53,2,FALSE),\"\")","v":"バタフライチェア　ネイビー"},5,{"$f":"IFERROR(VLOOKUP(O5,商品マスター!$B$7:$D$53,3,FALSE),\"\")","v":4900},{"$f":"IFERROR(Q5*R5,0)","v":24500},13102,{"$f":"IFERROR(VLOOKUP(T5,商品マスター!$B$7:$D$53,2,FALSE),\"\")","v":"木製折りたたみラック"},10,{"$f":"IFERROR(VLOOKUP(T5,商品マスター!$B$7:$D$53,3,FALSE),\"\")","v":2900},{"$f":"IFERROR(V5*W5,0)","v":29000},null,{"$f":"IFERROR(VLOOKUP(Y5,商品マスター!$B$7:$D$53,2,FALSE),\"\")","v":""},null,{"$f":"IFERROR(VLOOKUP(Y5,商品マスター!$B$7:$D$53,3,FALSE),\"\")","v":""},{"$f":"IFERROR(AA5*AB5,0)","v":0},null,{"$f":"IFERROR(VLOOKUP(AD5,商品マスター!$B$7:$D$53,2,FALSE),\"\")","v":""},null,{"$f":"IFERROR(VLOOKUP(AD5,商品マスター!$B$7:$D$53,3,FALSE),\"\")","v":""},{"$f":"IFERROR(AF5*AG5,0)","v":0},null,{"$f":"IFERROR(VLOOKUP(AI5,商品マスター!$B$7:$D$53,2,FALSE),\"\")","v":""},null,{"$f":"IFERROR(VLOOKUP(AI5,商品マスター!$B$7:$D$53,3,FALSE),\"\")","v":""},{"$f":"IFERROR(AK5*AL5,0)","v":0},null,{"$f":"IFERROR(VLOOKUP(AN5,商品マスター!$B$7:$D$53,2,FALSE),\"\")","v":""},null,{"$f":"IFERROR(VLOOKUP(AN5,商品マスター!$B$7:$D$53,3,FALSE),\"\")","v":""},{"$f":"IFERROR(AP5*AQ5,0)","v":0},null,{"$f":"IFERROR(VLOOKUP(AS5,商品マスター!$B$7:$D$53,2,FALSE),\"\")","v":""},null,{"$f":"IFERROR(VLOOKUP(AS5,商品マスター!$B$7:$D$53,3,FALSE),\"\")","v":""},{"$f":"IFERROR(AU5*AV5,0)","v":0},null,{"$f":"IFERROR(VLOOKUP(AX5,商品マスター!$B$7:$D$53,2,FALSE),\"\")","v":""},null,{"$f":"IFERROR(VLOOKUP(AX5,商品マスター!$B$7:$D$53,3,FALSE),\"\")","v":""},{"$f":"IFERROR(AZ5*BA5,0)","v":0},null,{"$f":"IFERROR(VLOOKUP(BC5,商品マスター!$B$7:$D$53,2,FALSE),\"\")","v":""},null,{"$f":"IFERROR(VLOOKUP(BC5,商品マスター!$B$7:$D$53,3,FALSE),\"\")","v":""},{"$f":"IFERROR(BE5*BF5,0)","v":0},null,{"$f":"IFERROR(VLOOKUP(BH5,商品マスター!$B$7:$D$53,2,FALSE),\"\")","v":""},null,{"$f":"IFERROR(VLOOKUP(BH5,商品マスター!$B$7:$D$53,3,FALSE),\"\")","v":""},{"$f":"IFERROR(BJ5*BK5,0)","v":0},{"$f":"IFERROR(S5+X5+AC5+AH5+AM5+AR5+AW5+BB5+BG5+BL5, \"\")","v":53500},0.1,{"$f":"IFERROR(BM5*BN5, \"\")","v":5350},50,{"$f":"BM5+BO5-BP5","v":58800}]
[]
["↑コピペ指示したデータが、貼り付けされていますか？"]
[]
{"$rows_left_out":16}
{"sheet":"見積書","index":3,"n_rows":35,"n_cols":15,"rows_kept":35,"cut":false,"hidden":false,"merged":[[0,1,0,14],[1,1,1,14],[3,1,4,8],[3,11,3,13],[4,11,4,13],[7,1,7,8],[7,10,7,13],[8,10,8,13],[9,10,9,13],[5,1,6,8],[10,10,10,13],[11,10,11,13],[13,1,14,3],[13,4,14,7],[13,8,14,8],[17,1,17,8],[17,9,17,10],[17,11,17,12],[17,13,17,14],[18,1,18,8],[18,9,18,10],[18,11,18,12],[18,13,18,14],[19,1,19,8],[19,9,19,10],[19,11,19,12],[19,13,19,14],[20,1,20,8],[20,9,20,10],[20,11,20,12],[20,13,20,14],[21,1,21,8],[21,9,21,10],[21,11,21,12],[21,13,21,14],[22,1,22,8],[22,9,22,10],[22,11,22,12],[22,13,22,14],[23,1,23,8],[23,9,23,10],[23,11,23,12],[23,13,23,14],[24,1,24,8],[24,9,24,10],[24,11,24,12],[24,13,24,14],[25,1,25,8],[25,9,25,10],[25,11,25,12],[25,13,25,14],[26,1,26,8],[26,9,26,10],[26,11,26,12],[26,13,26,14],[27,1,27,8],[27,9,27,10],[27,11,27,12],[27,13,27,14],[28,9,28,10],[28,11,28,14],[35,1,37,14],[34,1,34,14],[29,9,29,10],[29,11,29,14],[30,9,30,10],[30,11,30,14],[31,9,31,10],[31,11,31,14]]}
[null,"見　積　書"]
[null,"Quotation"]
[]
[null,{"$f":"印刷対象データ!I5","v":"東京ヒルズ"},null,null,null,null,null,null,null,null,"見積日：",{"$f":"印刷対象データ!B5","v":"2022-06-10"}]
[null,null,null,null,null,null,null,null,null,null,"伝票番号：",{"$f":"印刷対象データ!G5","v":22004},null,null,{"$f":"印刷対象データ!H5","v":2101}]
[null,{"$f":"CONCATENATE(印刷対象データ!J5,\"　様\")","v":"営業部　山下　様"}]
[]
[null,"下記の通り、お見積もりさせていただきます。ご検討のほど、よろしくお願いいたします。",null,null,null,null,null,null,null,null,{"$f":"事業主情報!C6","v":"Sample 株式会社"}]
{"$rows_left_out":28}
{"sheet":"納品書受領書","index":4,"n_rows":60,"n_cols":15,"rows_kept":60,"cut":false,"hidden":false,"merged":[[5,10,5,13],[6,10,6,13],[7,10,7,13],[0,1,0,14],[1,1,2,8],[1,11,1,13],[2,11,2,13],[3,1,4,8],[11,1,11,8],[11,9,11,10],[11,11,11,12],[11,13,11,14],[12,1,12,8],[12,9,12,10],[12,11,12,12],[12,13,12,14],[8,10,8,13],[9,10,9,13],[15,1,15,8],[15,9,15,10],[15,11,15,12],[15,13,15,14],[16,1,16,8],[16,9,16,10],[16,11,16,12],[16,13,16,14],[13,1,13,8],[13,9,13,10],[13,11,13,12],[13,13,13,14],[14,1,14,8],[14,9,14,10],[14,11,14,12],[14,13,14,14],[19,1,19,8],[19,9,19,10],[19,11,19,12],[19,13,19,14],[20,1,20,8],[20,9,20,10],[20,11,20,12],[20,13,20,14],[17,1,17,8],[17,9,17,10],[17,11,17,12],[17,13,17,14],[18,1,18,8],[18,9,18,10],[18,11,18,12],[18,13,18,14],[23,9,23,10],[23,11,23,14],[24,9,24,10],[24,11,24,14],[25,9,25,10],[25,11,25,14],[21,1,21,8],[21,9,21,10],[21,11,21,12],[21,13,21,14],[22,9,22,10],[22,11,22,14],[38,10,38,13],[39,10,39,13],[34,1,35,8],[36,10,36,13],[37,10,37,13],[31,1,31,14],[32,1,33,8],[32,11,32,13],[33,11,33,13],[40,10,40,13],[42,1,42,8],[42,9,42,10],[42,11,42,12],[42,13,42,14],[43,1,43,8],[43,9,43,10],[43,11,43,12],[43,13,43,14],[46,1,46,8],[46,9,46,10],[46,11,46,12],[46,13,46,14],[47,1,47,8],[47,9,47,10],[47,11,47,12],[47,13,47,14],[44,1,44,8],[44,9,44,10],[44,11,44,12],[44,13,44,14],[45,1,45,8],[45,9,45,10],[45,11,45,12],[45,13,45,14],[50,1,50,8],[50,9,50,10],[50,11,50,12],[50,13,50,14],[51,1,51,8],[51,9,51,10],[51,11,51,12],[51,13,51,14],[48,1,48,8],[48,9,48,10],[48,11,48,12],[48,13,48,14],[49,1,49,8],[49,9,49,10],[49,11,49,12],[49,13,49,14],[54,9,54,10],[54,11,54,14],[55,9,55,10],[55,11,55,14],[56,9,56,10],[56,11,56,14],[52,1,52,8],[52,9,52,10],[52,11,52,12],[52,13,52,14],[53,9,53,10],[53,11,53,14]]}
[null,"納　品　書"]
[null,{"$f":"印刷対象データ!I5","v":"東京ヒルズ"},null,null,null,null,null,null,null,null,"納品日：",{"$f":"印刷対象データ!D5","v":"2022-06-15"}]
[null,null,null,null,null,null,null,null,null,null,"伝票番号：",{"$f":"印刷対象データ!G5","v":22004},null,null,{"$f":"印刷対象データ!H5","v":2101}]
[null,{"$f":"CONCATENATE(印刷対象データ!J5,\"　様\")","v":"営業部　山下　様"}]
[]
[null,null,null,null,null,null,null,null,null,null,{"$f":"事業主情報!C6","v":"Sample 株式会社"}]
[null,null,null,null,null,null,null,null,null,null,{"$f":"事業主情報!C7","v":"〒100-0005"}]
[null,null,null,null,null,null,null,null,null,null,{"$f":"事業主情報!C8","v":"東京都千代田区丸の内１丁目"}]
{"$rows_left_out":53}
{"sheet":"請求書","index":5,"n_rows":38,"n_cols":15,"rows_kept":38,"cut":false,"hidden":false,"merged":[[31,9,31,10],[31,11,31,14],[34,1,34,14],[40,1,40,14],[29,11,29,14],[28,9,28,10],[28,11,28,14],[29,9,29,10],[30,9,30,10],[30,11,30,14],[27,1,27,8],[27,11,27,12],[27,13,27,14],[27,9,27,10],[25,1,25,8],[25,11,25,12],[25,13,25,14],[26,1,26,8],[26,11,26,12],[26,13,26,14],[25,9,25,10],[26,9,26,10],[23,1,23,8],[23,11,23,12],[23,13,23,14],[24,1,24,8],[24,11,24,12],[24,13,24,14],[23,9,23,10],[24,9,24,10],[21,1,21,8],[21,11,21,12],[21,13,21,14],[22,1,22,8],[22,11,22,12],[22,13,22,14],[21,9,21,10],[22,9,22,10],[17,13,17,14],[19,1,19,8],[19,11,19,12],[19,13,19,14],[20,1,20,8],[20,11,20,12],[20,13,20,14],[18,9,18,10],[19,9,19,10],[20,9,20,10],[18,1,18,8],[18,11,18,12],[18,13,18,14],[17,1,17,8],[17,9,17,10],[17,11,17,12],[10,1,10,2],[10,3,10,4],[10,10,10,13],[11,10,11,13],[13,1,14,3],[13,4,14,7],[13,8,14,8],[7,1,7,8],[7,10,7,13],[8,1,8,8],[8,10,8,13],[9,1,9,2],[9,3,9,4],[9,10,9,13],[5,1,6,8],[0,1,0,14],[1,1,1,14],[3,1,4,8],[3,11,3,13],[4,11,4,13]]}
[null,"請　求　書"]
[null,"INVOICE"]
[]
[null,{"$f":"印刷対象データ!I5","v":"東京ヒルズ"},null,null,null,null,null,null,null,null,"請求日：",{"$f":"印刷対象データ!E5","v":"2022-06-15"}]
[null,null,null,null,null,null,null,null,null,null,"伝票番号：",{"$f":"印刷対象データ!G5","v":22004},null,null,{"$f":"印刷対象データ!H5","v":2101}]
[null,{"$f":"CONCATENATE(印刷対象データ!J5,\"　様\")","v":"営業部　山下　様"}]
[]
[null,"下記の通りご請求申し上げます。",null,null,null,null,null,null,null,null,{"$f":"事業主情報!C6","v":"Sample 株式会社"}]
{"$rows_left_out":31}
{"sheet":"領収書","index":6,"n_rows":15,"n_cols":16,"rows_kept":15,"cut":false,"hidden":false,"merged":[[9,15,9,16],[0,1,0,12],[1,10,1,12],[2,10,2,12],[5,1,5,8],[7,1,7,2],[7,4,7,7],[4,1,4,8],[2,1,2,2],[2,3,2,8],[3,3,3,8],[10,4,10,6],[10,8,10,11],[8,3,8,9],[16,1,16,12],[11,4,11,6],[12,2,12,3],[12,4,12,6],[12,8,12,11],[13,2,13,3],[13,4,13,6],[13,8,13,11],[14,2,14,3],[14,4,14,6],[15,6,15,7],[15,9,15,10]]}
[null,"   領 収 書　"]
[null,null,null,null,null,null,null,null,null,"伝票番号",{"$f":"印刷対象データ!G5","v":22004},null,null,{"$f":"印刷対象データ!H5","v":2101}]
[null,{"$f":"印刷対象データ!K5","v":"123-4567"},null,{"$f":"印刷対象データ!L5","v":"東京都港区"},null,null,null,null,null,"発行日",{"$f":"印刷対象データ!F5","v":"2022-06-30"}]
[null,null,null,{"$f":"印刷対象データ!M5","v":"六本木10-20-30"}]
[null,{"$f":"印刷対象データ!I5","v":"東京ヒルズ"}]
[null,{"$f":"CONCATENATE(印刷対象データ!J5,\"　様\")","v":"営業部　山下　様"}]
[]
[null,"金額",null,null,{"$f":"印刷対象データ!BQ5","v":58800}]
{"$rows_left_out":8}
{"sheet":"得意先マスター","index":7,"n_rows":11,"n_cols":17,"rows_kept":11,"cut":false,"hidden":false,"merged":[[3,1,3,2]]}
[]
[]
[]
[null,"得意先マスター",null,null,null,null,null,null,null,null,"サンプルコード体系"]
[]
[null,"得意先\nコード","得意先名","担当者名","郵便番号","住所1","住所2","単価",null,null,null,"１桁目",null,"２桁目",null,"３桁目","備考"]
[null,1101,"東京アトリエ","商品開発部　新庄","131-0045","東京都墨田区","押上１丁目１−２","契約単価①",null,null,1,"定期契約",1,"Aランク","01～連番",null,"契約単価顧客"]
[null,2101,"東京ヒルズ","営業部　山下","123-4567","東京都港区","六本木10-20-30","標準単価",null,null,null,null,2,"Bランク"]
{"$rows_left_out":4}
{"sheet":"商品マスター","index":8,"n_rows":34,"n_cols":14,"rows_kept":34,"cut":false,"hidden":false,"merged":[[3,1,3,2]]}
[]
[]
[]
[null,"商品マスター",null,null,null,null,null,"サンプルコード体系"]
[]
[null,"商品\nコード","商品名","単価","備考",null,null,null,"１桁目",null,"２桁目",null,"３桁目","４桁目"]
[null,11101,"ミニテーブル",1200,"標準単価",null,null,1,"標準価格",1,"国内産",1,"木材","01～連番"]
[null,11201,"隙間に便利なミニテーブル",3000,"標準単価",null,null,null,null,null,null,2,"金属"]
{"$rows_left_out":27}
{"sheet":"事業主情報","index":9,"n_rows":22,"n_cols":5,"rows_kept":22,"cut":false,"hidden":false,"merged":[]}
[]
[]
[]
[null,"事業主情報",null,null,"振込情報"]
[]
[null,"名称","Sample 株式会社",null,"　銀行振込先：金融機関：XX銀行　　支店名：XX支店　　口座種別：普通"]
[null,"郵便番号","〒100-0005",null,"　口座番号：１２３４５６７　口座名義：株式会社　XX"]
[null,"住所","東京都千代田区丸の内１丁目",null,"　お振込み手数料は御社ご負担にてお願いいたします。"]
{"$rows_left_out":15}
{"sheet":"ログイン情報","index":10,"n_rows":5,"n_cols":2,"rows_kept":5,"cut":false,"hidden":false,"merged":[]}
["ID","パスワード"]
["admin","admin"]
["kishida","fumio"]
["東京","tokyo"]
["千葉","chiba"]